I am trying to set up Giraph with Hadoop 2.7.1
Try as I might, it doesn't seem to work.
I have tried following the below links,
http://giraph.apache.org/build.html
https://blog.cloudera.com/blog/2014/02/how-to-write-and-run-giraph-jobs-on-hadoop/
http://lab.hypotheses.org/1207
What happens when I try to build using mvn -Phadoop_yarn -Dhadoop.version=2.7.1 -DskipTests package
hadoopuser:/usr/local/giraph$ mvn -Phadoop_yarn -Dhadoop.version=2.7.1 -DskipTests package
[INFO] Scanning for projects...
[INFO] ------------------------------------------------------------------------
[INFO] Reactor Build Order:
[INFO]
[INFO] Apache Giraph Parent
[INFO] Apache Giraph Core
[INFO] Apache Giraph Examples
[INFO] Apache Giraph Distribution
[INFO]
[INFO] ------------------------------------------------------------------------
[INFO] Building Apache Giraph Parent 1.1.0
[INFO] ------------------------------------------------------------------------
[INFO]
[INFO] --- mavanagaiata:0.5.0:branch (git-commit) # giraph-parent ---
[INFO]
[INFO] --- mavanagaiata:0.5.0:commit (git-commit) # giraph-parent ---
[INFO]
[INFO] --- maven-enforcer-plugin:1.2:enforce (default) # giraph-parent ---
[INFO] Skipping Rule Enforcement.
[INFO]
[INFO] --- maven-dependency-versions-check-plugin:2.0.2:check (default) # giraph-parent ---
[INFO]
[INFO] --- maven-remote-resources-plugin:1.4:process (default) # giraph-parent ---
[INFO]
[INFO] --- maven-dependency-plugin:2.8:analyze-only (default) # giraph-parent ---
[INFO] Skipping plugin execution
[INFO]
[INFO] --- maven-dependency-plugin:2.8:analyze-duplicate (default) # giraph-parent ---
[INFO] Skipping plugin execution
[INFO]
[INFO] --- maven-dependency-plugin:2.8:analyze-dep-mgt (default) # giraph-parent ---
[INFO] Skipping plugin execution
[INFO]
[INFO] --- maven-duplicate-finder-plugin:1.0.4:check (default) # giraph-parent ---
[INFO]
[INFO] --- maven-site-plugin:3.3:attach-descriptor (attach-descriptor) # giraph-parent ---
[INFO]
[INFO] ------------------------------------------------------------------------
[INFO] Building Apache Giraph Core 1.1.0
[INFO] ------------------------------------------------------------------------
[INFO]
[INFO] --- mavanagaiata:0.5.0:branch (git-commit) # giraph-core ---
[INFO]
[INFO] --- mavanagaiata:0.5.0:commit (git-commit) # giraph-core ---
[INFO]
[INFO] --- maven-enforcer-plugin:1.2:enforce (default) # giraph-core ---
[INFO] Skipping Rule Enforcement.
[INFO]
[INFO] --- maven-dependency-versions-check-plugin:2.0.2:check (default) # giraph-core ---
[INFO]
[INFO] --- munge-maven-plugin:1.0:munge (munge) # giraph-core ---
[INFO]
[INFO] --- maven-remote-resources-plugin:1.4:process (default) # giraph-core ---
[INFO]
[INFO] --- maven-resources-plugin:2.6:resources (default-resources) # giraph-core ---
[INFO] Using 'UTF-8' encoding to copy filtered resources.
[INFO] Copying 2 resources
[INFO] Copying 3 resources
[INFO]
[INFO] --- maven-compiler-plugin:3.0:compile (default-compile) # giraph-core ---
[INFO] Changes detected - recompiling the module!
[INFO] Compiling 711 source files to /usr/local/giraph/giraph-core/target/munged/classes
[INFO] -------------------------------------------------------------
[WARNING] COMPILATION WARNING :
[INFO] -------------------------------------------------------------
[WARNING] /usr/local/giraph/giraph-core/target/munged/main/org/apache/giraph/utils/UnsafeByteArrayOutputStream.java:[42,29] sun.misc.Unsafe is internal proprietary API and may be removed in a future release
[WARNING] /usr/local/giraph/giraph-core/target/munged/main/org/apache/giraph/utils/UnsafeByteArrayOutputStream.java:[44,25] sun.misc.Unsafe is internal proprietary API and may be removed in a future release
[WARNING] /usr/local/giraph/giraph-core/target/munged/main/org/apache/giraph/utils/UnsafeByteArrayOutputStream.java:[57,32] sun.misc.Unsafe is internal proprietary API and may be removed in a future release
[WARNING] /usr/local/giraph/giraph-core/target/munged/main/org/apache/giraph/utils/UnsafeArrayReads.java:[39,32] sun.misc.Unsafe is internal proprietary API and may be removed in a future release
[WARNING] /usr/local/giraph/giraph-core/target/munged/main/org/apache/giraph/utils/UnsafeArrayReads.java:[42,29] sun.misc.Unsafe is internal proprietary API and may be removed in a future release
[WARNING] /usr/local/giraph/giraph-core/target/munged/main/org/apache/giraph/utils/UnsafeArrayReads.java:[44,25] sun.misc.Unsafe is internal proprietary API and may be removed in a future release
[WARNING] /usr/local/giraph/giraph-core/target/munged/main/org/apache/giraph/utils/DistributedCacheUtils.java: Some input files use or override a deprecated API.
[WARNING] /usr/local/giraph/giraph-core/target/munged/main/org/apache/giraph/utils/DistributedCacheUtils.java: Recompile with -Xlint:deprecation for details.
[WARNING] /usr/local/giraph/giraph-core/target/munged/main/org/apache/giraph/utils/TestGraph.java: Some input files use unchecked or unsafe operations.
[WARNING] /usr/local/giraph/giraph-core/target/munged/main/org/apache/giraph/utils/TestGraph.java: Recompile with -Xlint:unchecked for details.
[INFO] 10 warnings
[INFO] -------------------------------------------------------------
[INFO] -------------------------------------------------------------
[ERROR] COMPILATION ERROR :
[INFO] -------------------------------------------------------------
[ERROR] /usr/local/giraph/giraph-core/target/munged/main/org/apache/giraph/comm/netty/SaslNettyClient.java:[84,68] cannot find symbol
symbol: variable SASL_PROPS
location: class org.apache.hadoop.security.SaslRpcServer
[ERROR] /usr/local/giraph/giraph-core/target/munged/main/org/apache/giraph/comm/netty/SaslNettyServer.java:[105,62] cannot find symbol
symbol: variable SASL_PROPS
location: class org.apache.hadoop.security.SaslRpcServer
[INFO] 2 errors
[INFO] -------------------------------------------------------------
[INFO] ------------------------------------------------------------------------
[INFO] Reactor Summary:
[INFO]
[INFO] Apache Giraph Parent ............................... SUCCESS [ 4.374 s]
[INFO] Apache Giraph Core ................................. FAILURE [ 8.469 s]
[INFO] Apache Giraph Examples ............................. SKIPPED
[INFO] Apache Giraph Distribution ......................... SKIPPED
[INFO] ------------------------------------------------------------------------
[INFO] BUILD FAILURE
[INFO] ------------------------------------------------------------------------
[INFO] Total time: 13.136 s
[INFO] Finished at: 2015-11-16T10:19:07+05:30
[INFO] Final Memory: 45M/335M
[INFO] ------------------------------------------------------------------------
[ERROR] Failed to execute goal org.apache.maven.plugins:maven-compiler-plugin:3.0:compile (default-compile) on project giraph-core: Compilation failure: Compilation failure:
[ERROR] /usr/local/giraph/giraph-core/target/munged/main/org/apache/giraph/comm/netty/SaslNettyClient.java:[84,68] cannot find symbol
[ERROR] symbol: variable SASL_PROPS
[ERROR] location: class org.apache.hadoop.security.SaslRpcServer
[ERROR] /usr/local/giraph/giraph-core/target/munged/main/org/apache/giraph/comm/netty/SaslNettyServer.java:[105,62] cannot find symbol
[ERROR] symbol: variable SASL_PROPS
[ERROR] location: class org.apache.hadoop.security.SaslRpcServer
[ERROR] -> [Help 1]
[ERROR]
[ERROR] To see the full stack trace of the errors, re-run Maven with the -e switch.
[ERROR] Re-run Maven using the -X switch to enable full debug logging.
[ERROR]
[ERROR] For more information about the errors and possible solutions, please read the following articles:
[ERROR] [Help 1] http://cwiki.apache.org/confluence/display/MAVEN/MojoFailureException
[ERROR]
[ERROR] After correcting the problems, you can resume the build with the command
[ERROR] mvn <goals> -rf :giraph-cor
What happens when I try to build using, mvn -Phadoop_yarn -Dhadoop.version=2.7.1 -DskipTests install
hadoopuser:/usr/local/giraph$ mvn -Phadoop_yarn -Dhadoop.version=2.7.1 -DskipTests install
[INFO] Scanning for projects...
[INFO] ------------------------------------------------------------------------
[INFO] Reactor Build Order:
[INFO]
[INFO] Apache Giraph Parent
[INFO] Apache Giraph Core
[INFO] Apache Giraph Examples
[INFO] Apache Giraph Distribution
[INFO]
[INFO] ------------------------------------------------------------------------
[INFO] Building Apache Giraph Parent 1.1.0
[INFO] ------------------------------------------------------------------------
[INFO]
[INFO] --- mavanagaiata:0.5.0:branch (git-commit) # giraph-parent ---
[INFO]
[INFO] --- mavanagaiata:0.5.0:commit (git-commit) # giraph-parent ---
[INFO]
[INFO] --- maven-enforcer-plugin:1.2:enforce (default) # giraph-parent ---
[INFO] Skipping Rule Enforcement.
[INFO]
[INFO] --- maven-dependency-versions-check-plugin:2.0.2:check (default) # giraph-parent ---
[INFO]
[INFO] --- maven-remote-resources-plugin:1.4:process (default) # giraph-parent ---
[INFO]
[INFO] --- maven-dependency-plugin:2.8:analyze-only (default) # giraph-parent ---
[INFO] Skipping plugin execution
[INFO]
[INFO] --- maven-dependency-plugin:2.8:analyze-duplicate (default) # giraph-parent ---
[INFO] Skipping plugin execution
[INFO]
[INFO] --- maven-dependency-plugin:2.8:analyze-dep-mgt (default) # giraph-parent ---
[INFO] Skipping plugin execution
[INFO]
[INFO] --- maven-duplicate-finder-plugin:1.0.4:check (default) # giraph-parent ---
[INFO]
[INFO] --- maven-site-plugin:3.3:attach-descriptor (attach-descriptor) # giraph-parent ---
[INFO]
[INFO] --- maven-install-plugin:2.3.1:install (default-install) # giraph-parent ---
[INFO] Installing /usr/local/giraph/pom.xml to /home/hadoopuser/.m2/repository/org/apache/giraph/giraph-parent/1.1.0/giraph-parent-1.1.0.pom
[INFO] Installing /usr/local/giraph/target/giraph-parent-1.1.0-site.xml to /home/hadoopuser/.m2/repository/org/apache/giraph/giraph-parent/1.1.0/giraph-parent-1.1.0-site.xml
[INFO]
[INFO] ------------------------------------------------------------------------
[INFO] Building Apache Giraph Core 1.1.0
[INFO] ------------------------------------------------------------------------
[INFO]
[INFO] --- mavanagaiata:0.5.0:branch (git-commit) # giraph-core ---
[INFO]
[INFO] --- mavanagaiata:0.5.0:commit (git-commit) # giraph-core ---
[INFO]
[INFO] --- maven-enforcer-plugin:1.2:enforce (default) # giraph-core ---
[INFO] Skipping Rule Enforcement.
[INFO]
[INFO] --- maven-dependency-versions-check-plugin:2.0.2:check (default) # giraph-core ---
[INFO]
[INFO] --- munge-maven-plugin:1.0:munge (munge) # giraph-core ---
[INFO]
[INFO] --- maven-remote-resources-plugin:1.4:process (default) # giraph-core ---
[INFO]
[INFO] --- maven-resources-plugin:2.6:resources (default-resources) # giraph-core ---
[INFO] Using 'UTF-8' encoding to copy filtered resources.
[INFO] Copying 2 resources
[INFO] Copying 3 resources
[INFO]
[INFO] --- maven-compiler-plugin:3.0:compile (default-compile) # giraph-core ---
[INFO] Changes detected - recompiling the module!
[INFO] Compiling 711 source files to /usr/local/giraph/giraph-core/target/munged/classes
[INFO] -------------------------------------------------------------
[WARNING] COMPILATION WARNING :
[INFO] -------------------------------------------------------------
[WARNING] /usr/local/giraph/giraph-core/target/munged/main/org/apache/giraph/utils/UnsafeByteArrayOutputStream.java:[42,29] sun.misc.Unsafe is internal proprietary API and may be removed in a future release
[WARNING] /usr/local/giraph/giraph-core/target/munged/main/org/apache/giraph/utils/UnsafeByteArrayOutputStream.java:[44,25] sun.misc.Unsafe is internal proprietary API and may be removed in a future release
[WARNING] /usr/local/giraph/giraph-core/target/munged/main/org/apache/giraph/utils/UnsafeByteArrayOutputStream.java:[57,32] sun.misc.Unsafe is internal proprietary API and may be removed in a future release
[WARNING] /usr/local/giraph/giraph-core/target/munged/main/org/apache/giraph/utils/UnsafeArrayReads.java:[39,32] sun.misc.Unsafe is internal proprietary API and may be removed in a future release
[WARNING] /usr/local/giraph/giraph-core/target/munged/main/org/apache/giraph/utils/UnsafeArrayReads.java:[42,29] sun.misc.Unsafe is internal proprietary API and may be removed in a future release
[WARNING] /usr/local/giraph/giraph-core/target/munged/main/org/apache/giraph/utils/UnsafeArrayReads.java:[44,25] sun.misc.Unsafe is internal proprietary API and may be removed in a future release
[WARNING] /usr/local/giraph/giraph-core/target/munged/main/org/apache/giraph/utils/DistributedCacheUtils.java: Some input files use or override a deprecated API.
[WARNING] /usr/local/giraph/giraph-core/target/munged/main/org/apache/giraph/utils/DistributedCacheUtils.java: Recompile with -Xlint:deprecation for details.
[WARNING] /usr/local/giraph/giraph-core/target/munged/main/org/apache/giraph/utils/TestGraph.java: Some input files use unchecked or unsafe operations.
[WARNING] /usr/local/giraph/giraph-core/target/munged/main/org/apache/giraph/utils/TestGraph.java: Recompile with -Xlint:unchecked for details.
[INFO] 10 warnings
[INFO] -------------------------------------------------------------
[INFO] -------------------------------------------------------------
[ERROR] COMPILATION ERROR :
[INFO] -------------------------------------------------------------
[ERROR] /usr/local/giraph/giraph-core/target/munged/main/org/apache/giraph/comm/netty/SaslNettyClient.java:[84,68] cannot find symbol
symbol: variable SASL_PROPS
location: class org.apache.hadoop.security.SaslRpcServer
[ERROR] /usr/local/giraph/giraph-core/target/munged/main/org/apache/giraph/comm/netty/SaslNettyServer.java:[105,62] cannot find symbol
symbol: variable SASL_PROPS
location: class org.apache.hadoop.security.SaslRpcServer
[INFO] 2 errors
[INFO] -------------------------------------------------------------
[INFO] ------------------------------------------------------------------------
[INFO] Reactor Summary:
[INFO]
[INFO] Apache Giraph Parent ............................... SUCCESS [ 4.360 s]
[INFO] Apache Giraph Core ................................. FAILURE [ 7.473 s]
[INFO] Apache Giraph Examples ............................. SKIPPED
[INFO] Apache Giraph Distribution ......................... SKIPPED
[INFO] ------------------------------------------------------------------------
[INFO] BUILD FAILURE
[INFO] ------------------------------------------------------------------------
[INFO] Total time: 12.122 s
[INFO] Finished at: 2015-11-16T10:26:04+05:30
[INFO] Final Memory: 46M/374M
[INFO] ------------------------------------------------------------------------
[ERROR] Failed to execute goal org.apache.maven.plugins:maven-compiler-plugin:3.0:compile (default-compile) on project giraph-core: Compilation failure: Compilation failure:
[ERROR] /usr/local/giraph/giraph-core/target/munged/main/org/apache/giraph/comm/netty/SaslNettyClient.java:[84,68] cannot find symbol
[ERROR] symbol: variable SASL_PROPS
[ERROR] location: class org.apache.hadoop.security.SaslRpcServer
[ERROR] /usr/local/giraph/giraph-core/target/munged/main/org/apache/giraph/comm/netty/SaslNettyServer.java:[105,62] cannot find symbol
[ERROR] symbol: variable SASL_PROPS
[ERROR] location: class org.apache.hadoop.security.SaslRpcServer
[ERROR] -> [Help 1]
[ERROR]
[ERROR] To see the full stack trace of the errors, re-run Maven with the -e switch.
[ERROR] Re-run Maven using the -X switch to enable full debug logging.
[ERROR]
[ERROR] For more information about the errors and possible solutions, please read the following articles:
[ERROR] [Help 1] http://cwiki.apache.org/confluence/display/MAVEN/MojoFailureException
[ERROR]
[ERROR] After correcting the problems, you can resume the build with the command
[ERROR] mvn <goals> -rf :giraph-core
---
Version information follows,
Hadoop:
hadoopuser:~$ hadoop version
Hadoop 2.7.1
Subversion https://git-wip-us.apache.org/repos/asf/hadoop.git -r 15ecc87ccf4a0228f35af08fc56de536e6ce657a
Compiled by jenkins on 2015-06-29T06:04Z
Compiled with protoc 2.5.0
From source with checksum fc0a1a23fc1868e4d5ee7fa2b28a58a
This command was run using /usr/local/hadoop/share/hadoop/common/hadoop-common-2.7.1.jar
Giraph is version 1.1.0 downloaded from here : http://archive.apache.org/dist/giraph/giraph-1.1.0/giraph-dist-1.1.0-src.tar.bz2
Java
hadoopuser:~$ java -version
java version "1.8.0_05"
Java(TM) SE Runtime Environment (build 1.8.0_05-b13)
Java HotSpot(TM) 64-Bit Server VM (build 25.5-b02, mixed mode)
Maven
hadoopuser:~$ mvn -version
Apache Maven 3.3.3 (7994120775791599e205a5524ec3e0dfe41d4a06; 2015-04-22T17:27:37+05:30)
Maven home: /opt/apache-maven-3.3.3
Java version: 1.8.0_05, vendor: Oracle Corporation
Java home: /usr/lib/jvm/jdk1.8.0/jre
Default locale: en_IN, platform encoding: UTF-8
OS name: "linux", version: "3.13.0-68-generic", arch: "amd64", family: "unix"
Edit:
As was suggested by Steve Kaeser in his answer I changed my pom.xlm and changed part is shown below.
<properties>
<hadoop.version>SET_HADOOP_VERSION_USING_MVN_DASH_D_OPTION</hadoop.version>
<munge.symbols>PURE_YARN</munge.symbols>
<!-- TODO: add these checks eventually -->
<project.enforcer.skip>true</project.enforcer.skip>
<giraph.maven.dependency.plugin.skip>true</giraph.maven.dependency.plugin.skip>
<giraph.maven.duplicate.finder.skip>true</giraph.maven.duplicate.finder.skip>
</properties>
After doing this when I run mvn -Phadoop_yarn -Dhadoop.version=2.7.1 -DskipTests install I get a lot of output and it fails. Parts of the output are shown below,
[INFO]
[INFO] --- apache-rat-plugin:0.8:check (default) # giraph-core ---
[INFO] Exclude: CODE_CONVENTIONS
[INFO] Exclude: **/target/**
[INFO] Exclude: /_bsp/**
[INFO] Exclude: .checkstyle
[INFO] Exclude: .reviewboardrc
[INFO] Exclude: .git/**
[INFO] Exclude: .gitignore
[INFO] Exclude: .arcconfig
[INFO] Exclude: *.patch
[INFO] Exclude: .idea/**
[INFO] Exclude: **/*.iml
[INFO] Exclude: **/*.ipr
[INFO] Exclude: **/test/resources/**
[INFO] Exclude: giraph-gora/conf/*
[INFO] Exclude: giraph-rexster/giraph-kibble/src/main/resources/META-INF/services/com.tinkerpop.rexster.extension.RexsterExtension
[INFO] Exclude: src/site/resources/images/*.svg
[INFO]
[INFO] >>> findbugs-maven-plugin:2.5.1:check (default) > :findbugs # giraph-core >>>
[INFO]
[INFO] --- findbugs-maven-plugin:2.5.1:findbugs (findbugs) # giraph-core ---
[INFO] Fork Value is true
[java] The following errors occurred during analysis:
[java] Nov 17, 2015 3:16:36 PM edu.umd.cs.findbugs.TextUIBugReporter reportAnalysisError
[java] SEVERE: Error scanning java/util/Comparator for referenced classes
[java] java.lang.ArrayIndexOutOfBoundsException: 51966
[java] at org.objectweb.asm.ClassReader.readUTF8(Unknown Source)
[java] at org.objectweb.asm.ClassReader.readClass(Unknown Source)
.
.
.
.
.
.
.
.
[INFO] Reactor Summary:
[INFO]
[INFO] Apache Giraph Parent ............................... SUCCESS [ 4.140 s]
[INFO] Apache Giraph Core ................................. FAILURE [ 37.541 s]
[INFO] Apache Giraph Examples ............................. SKIPPED
[INFO] Apache Giraph Distribution ......................... SKIPPED
[INFO] ------------------------------------------------------------------------
[INFO] BUILD FAILURE
[INFO] ------------------------------------------------------------------------
[INFO] Total time: 41.972 s
[INFO] Finished at: 2015-11-17T15:16:37+05:30
[INFO] Final Memory: 68M/537M
[INFO] ------------------------------------------------------------------------
[ERROR] Failed to execute goal org.codehaus.mojo:findbugs-maven-plugin:2.5.1:findbugs (findbugs) on project giraph-core: Execution findbugs of goal org.codehaus.mojo:findbugs-maven-plugin:2.5.1:findbugs failed: Java returned: 1 -> [Help 1]
[ERROR]
I ran into this issue today. Finally I needed two patches to fix it:
Open pom.xml in base directory and replace <munge.symbols>PURE_YARN,STATIC_SASL_SYMBOL</munge.symbols> with: <munge.symbols>PURE_YARN</munge.symbols>
Apply patch found here: GIRAPH-1110.02.patch
Build using the clean flag of maven: mvn -Phadoop_yarn -Dhadoop.version=2.7.3 clean package -DskipTests
I just ran into this issue earlier today and found a reply in the mailing list that suggests removing STATIC_SASL_SYMBOL from munge.symbols in the hadoop_yarn profile.
I was able to build that profile after making that change.
Here is the link to the mailing list archive: http://mail-archives.apache.org/mod_mbox/giraph-user/201501.mbox/%3C54B17196.4040107#hiro-tan.org%3E
Related
so i have been trying to deploy my spring microservices using jib and it has been really fustrating :(
I have been jumping from one issue to another and right now i dont how to get out of this present situation... I have used openjdk 17 alphine and this is the logs i get from my build...
PS C:\xampp\htdocs\weddingapp-main\weddingapp> mvn clean compile jib:build -rf :discovery-service [INFO] Scanning for projects...
[INFO] ------------------------------------------------------------------------
[INFO] Reactor Build Order:
[INFO]
[INFO] discovery-service [jar]
[INFO] api-gateway [jar]
[INFO] wedding [jar]
[INFO] users [jar]
[INFO]
[INFO] -----------------< com.slinkdigital:discovery-service >-----------------
[INFO] Building discovery-service 1.0-SNAPSHOT [1/4]
[INFO] --------------------------------[ jar ]---------------------------------
[INFO]
[INFO] --- maven-clean-plugin:2.5:clean (default-clean) # discovery-service ---
[INFO] Deleting C:\xampp\htdocs\weddingapp-main\weddingapp\discovery-service\target
[INFO]
[INFO] --- maven-resources-plugin:2.6:resources (default-resources) # discovery-service ---
[INFO] Using 'UTF-8' encoding to copy filtered resources.
[INFO] Copying 2 resources
[INFO]
[INFO] --- maven-compiler-plugin:3.8.1:compile (default-compile) # discovery-service ---
[INFO] Changes detected - recompiling the module!
[INFO] Compiling 2 source files to C:\xampp\htdocs\weddingapp-main\weddingapp\discovery-service\target\classes
[INFO]
[INFO] --- jib-maven-plugin:3.3.0:build (default-cli) # discovery-service ---
[INFO]
[INFO] Containerizing application to registry.hub.docker.com/davidtega/discovery-service...
[INFO] Using credentials from Maven settings file for registry.hub.docker.com/davidtega/discovery-service
[INFO]
[INFO] Container entrypoint set to [java, -cp, #/app/jib-classpath-file, com.slinkdigital.eureka.DiscoveryServiceApplication]
[WARNING] PATCH https://registry.hub.docker.com/v2/davidtega/discovery-service/blobs/uploads/79257277-0299-4f05-90cc-e33f34d3a44a?_state=P1UgMi0NjbwAR3C9mu77RBBM0P2yRJNUC5Qz-wEGppl7Ik5hbWUiOiJkYXZpZHRlZ2EvZGlzY292ZXJ5LXNlcnZpY2UiLCJVVUlEIjoiNzkyNTcyNzctMDI5OS00ZjA1LTkwY2MtZTMzZjM0ZDNhNDRhIiwiT2Zmc2V0IjowLCJTdGFydGVkQXQiOiIyMDIyLTEwLTEyVDA0OjMyOjU2Ljg4OTcxNzc4OFoifQ%3D%3D failed and will NOT be retried
[ERROR] I/O error for image [registry.hub.docker.com/davidtega/discovery-service]:
[ERROR] java.net.SocketException
[ERROR] An established connection was aborted by the software in your host machine
[INFO] Executing tasks:
[INFO] [======================= ] 77.8% complete
[INFO] > launching layer pushers
[INFO] > scheduling pushing manifests
[INFO]
[INFO] ------------------------------------------------------------------------
[INFO] Reactor Summary for discovery-service 1.0-SNAPSHOT:
[INFO]
[INFO] discovery-service .................................. FAILURE [32:57 min]
[INFO] api-gateway ........................................ SKIPPED
[INFO] wedding ............................................ SKIPPED
[INFO] users .............................................. SKIPPED
[INFO] ------------------------------------------------------------------------
[INFO] BUILD FAILURE
[INFO] ------------------------------------------------------------------------
[INFO] Total time: 32:58 min
[INFO] Finished at: 2022-10-12T06:05:32+01:00
[INFO] ------------------------------------------------------------------------
[ERROR] Failed to execute goal com.google.cloud.tools:jib-maven-plugin:3.3.0:build (default-cli) on project discovery-service: An established connection was aborted by the software in your host machine -> [Help 1]
[ERROR]
[ERROR] To see the full stack trace of the errors, re-run Maven with the -e switch.
[ERROR] Re-run Maven using the -X switch to enable full debug logging.
[ERROR]
[ERROR] For more information about the errors and possible solutions, please read the following articles:
[ERROR] [Help 1] http://cwiki.apache.org/confluence/display/MAVEN/MojoExecutionException
I have restarted my pc severally, cleaned up my config.json file and tried every other solution i have seen but its still not working, i will appreciate the assistance... Thanks
When I try to start the application from Tomcat Web Application Manager it shows this error...
FAIL - Application at context path [/surveyreporting] could not be started
FAIL - Encountered exception [org.apache.catalina.LifecycleException: Failed to start component [StandardEngine[Catalina].StandardHost[localhost].StandardContext[/surveyreporting]]]
And When I make war file using Mavin this is what happen....
[INFO] Scanning for projects...
[INFO]
[INFO] ------------------------------------------------------------------------
[INFO] Building springboottest 1.0
[INFO] ------------------------------------------------------------------------
[INFO]
[INFO] --- lombok-maven-plugin:1.16.8.0:delombok (default) # surveyreporting ---
[WARNING] Skipping Delombok; no source to process.
[INFO]
[INFO] --- maven-resources-plugin:3.0.1:resources (default-resources) # surveyreporting ---
[INFO] Using 'UTF-8' encoding to copy filtered resources.
[INFO] Copying 1 resource
[INFO] Copying 1393 resources
[INFO]
[INFO] --- maven-compiler-plugin:3.7.0:compile (default-compile) # surveyreporting ---
[INFO] Changes detected - recompiling the module!
[INFO] Compiling 143 source files to /var/www/html/new/surveyreporting/target/classes
[WARNING] /var/www/html/new/surveyreporting/src/main/java/com/piccibhai/Controller/HomeController.java:[18,47] com.sun.org.apache.xerces.internal.util.URI is internal proprietary API and may be removed in a future release
[WARNING] /var/www/html/new/surveyreporting/src/main/java/com/piccibhai/Controller/HomeController.java:[18,47] com.sun.org.apache.xerces.internal.util.URI is internal proprietary API and may be removed in a future release
[WARNING] /var/www/html/new/surveyreporting/src/main/java/com/piccibhai/Controller/HomeController.java:[18,47] com.sun.org.apache.xerces.internal.util.URI is internal proprietary API and may be removed in a future release
[WARNING] /var/www/html/new/surveyreporting/src/main/java/com/piccibhai/Controller/HomeController.java:[18,47] com.sun.org.apache.xerces.internal.util.URI is internal proprietary API and may be removed in a future release
[WARNING] /var/www/html/new/surveyreporting/src/main/java/com/piccibhai/Controller/HomeController.java:[348,9] com.sun.org.apache.xerces.internal.util.URI is internal proprietary API and may be removed in a future release
[WARNING] /var/www/html/new/surveyreporting/src/main/java/com/piccibhai/Controller/HomeController.java:[350,23] com.sun.org.apache.xerces.internal.util.URI is internal proprietary API and may be removed in a future release
[WARNING] /var/www/html/new/surveyreporting/src/main/java/com/piccibhai/Controller/HomeController.java:[351,18] com.sun.org.apache.xerces.internal.util.URI is internal proprietary API and may be removed in a future release
[INFO] /var/www/html/new/surveyreporting/src/main/java/com/piccibhai/Controller/Data/Download/PPRDownloadRequest.java: Some input files use unchecked or unsafe operations.
[INFO] /var/www/html/new/surveyreporting/src/main/java/com/piccibhai/Controller/Data/Download/PPRDownloadRequest.java: Recompile with -Xlint:unchecked for details.
[INFO]
[INFO] --- maven-resources-plugin:3.0.1:testResources (default-testResources) # surveyreporting ---
[INFO] Using 'UTF-8' encoding to copy filtered resources.
[INFO] skip non existing resourceDirectory /var/www/html/new/surveyreporting/src/test/resources
[INFO]
[INFO] --- maven-compiler-plugin:3.7.0:testCompile (default-testCompile) # surveyreporting ---
[INFO] Nothing to compile - all classes are up to date
[INFO]
[INFO] --- maven-surefire-plugin:2.21.0:test (default-test) # surveyreporting ---
[INFO] No tests to run.
[INFO]
[INFO] --- maven-war-plugin:3.1.0:war (default-war) # surveyreporting ---
[INFO] Packaging webapp
[INFO] Assembling webapp [surveyreporting] in [/var/www/html/new/surveyreporting/target/surveyreporting-1.0]
[INFO] Processing war project
[INFO] Webapp assembled in [2378 msecs]
[INFO] Building war: /var/www/html/new/surveyreporting/target/surveyreporting-1.0.war
[INFO]
[INFO] --- spring-boot-maven-plugin:2.0.3.RELEASE:repackage (default) # surveyreporting ---
[INFO]
[INFO] --- maven-install-plugin:2.5.2:install (default-install) # surveyreporting ---
[INFO] Installing /var/www/html/new/surveyreporting/target/surveyreporting-1.0.war to /home/tapumandal/.m2/repository/com/piccibhai/surveyreporting/1.0/surveyreporting-1.0.war
[INFO] Installing /var/www/html/new/surveyreporting/pom.xml to /home/tapumandal/.m2/repository/com/piccibhai/surveyreporting/1.0/surveyreporting-1.0.pom
[INFO]
[INFO] --- maven-deploy-plugin:2.8.2:deploy (default-deploy) # surveyreporting ---
[INFO] ------------------------------------------------------------------------
[INFO] BUILD FAILURE
[INFO] ------------------------------------------------------------------------
[INFO] Total time: 40.825 s
[INFO] Finished at: 2019-03-05T14:27:44+06:00
[INFO] Final Memory: 51M/757M
[INFO] ------------------------------------------------------------------------
[ERROR] Failed to execute goal org.apache.maven.plugins:maven-deploy-plugin:2.8.2:deploy (default-deploy) on project surveyreporting: Failed to deploy artifacts/metadata: Cannot access scp://localhost/surveyreporting with type default using the available connector factories: BasicRepositoryConnectorFactory: Cannot access scp://localhost/surveyreporting using the registered transporter factories: WagonTransporterFactory: java.util.NoSuchElementException
[ERROR] role: org.apache.maven.wagon.Wagon
[ERROR] roleHint: scp
[ERROR] -> [Help 1]
[ERROR]
[ERROR] To see the full stack trace of the errors, re-run Maven with the -e switch.
[ERROR] Re-run Maven using the -X switch to enable full debug logging.
[ERROR]
[ERROR] For more information about the errors and possible solutions, please read the following articles:
[ERROR] [Help 1] http://cwiki.apache.org/confluence/display/MAVEN/MojoExecutionException
Process finished with exit code 1
By the way the application runs on my computer(local) fine.
Server Information
Tomcat Version : Apache Tomcat/8.5.34
JVM Version : 1.8.0_191-b12
My Computer(local)
java version "1.8.0_181"
the error info
[ERROR] Failed to execute goal org.apache.maven.plugins:maven-deploy-plugin:2.8.2:deploy (default-deploy) on project surveyreporting: Failed to deploy artifacts/metadata: Cannot access scp://localhost/surveyreporting with type default using the available connector factories: BasicRepositoryConnectorFactory: Cannot access scp://localhost/surveyreporting using the registered transporter factories: WagonTransporterFactory: java.util.NoSuchElementException
so,u need update scp url address
I am trying to make a new project on Hippocms. I have followed the steps from the onehippo web page. I have downloaded Maven seperately. I have removed all the metadatas from other projects, but it keeps showing me the same error when I ran mvn clean verify. I have deleted the repository multiple times
and I still got this message. The problem is that there are not any solutions on the Internet especially for Hippo.
[Hippo Errors][1].
C:\Users\Administrator\myhippoproject>mvn clean verify
[INFO] Scanning for projects...
[INFO] ------------------------------------------------------------------------
[INFO] Reactor Build Order:
[INFO]
[INFO] My Hippo Project
[INFO] My Hippo Project Repository Data
[INFO] My Hippo Project Repository Data For Application
[INFO] My Hippo Project Repository Data For Development
[INFO] My Hippo Project Site
[INFO] My Hippo Project Repository Data Web Files
[INFO] My Hippo Project CMS
[INFO] My Hippo Project Essentials
[INFO]
[INFO] ------------------------------------------------------------------------
[INFO] Building My Hippo Project 0.1.0-SNAPSHOT
[INFO] ------------------------------------------------------------------------
[INFO]
[INFO] --- maven-clean-plugin:2.5:clean (default-clean) # myhippoproject ---
[INFO]
[INFO] --- maven-enforcer-plugin:1.4:enforce (enforce-maven-versions) #
myhippoproject ---
[INFO]
[INFO] --- build-helper-maven-plugin:3.0.0:regex-property (property-
commandline-offline) # myhippoproject ---
[INFO] No match to regex '"true"' found in '"false"'. The initial value
'"false"' is left as-is...
[INFO]
[INFO] --- build-helper-maven-plugin:3.0.0:regex-property (property-
commandline-online) # myhippoproject ---
[INFO]
[INFO] --- maven-remote-resources-plugin:1.5:process (default) #
myhippoproject ---
[INFO]
[INFO] --- maven-source-plugin:3.0.1:jar-no-fork (attach-sources-no-fork) #
myhippoproject ---
[INFO]
[INFO] ---------------------------------------------------------------------
---
[INFO] Building My Hippo Project Repository Data 0.1.0-SNAPSHOT
[INFO] ---------------------------------------------------------------------
---
[INFO]
[INFO] --- maven-clean-plugin:2.5:clean (default-clean) # myhippoproject-
repository-data ---
[INFO]
[INFO] --- maven-enforcer-plugin:1.4:enforce (enforce-maven-versions) #
myhippoproject-repository-data ---
[INFO]
[INFO] --- build-helper-maven-plugin:3.0.0:regex-property (property-
commandline-offline) # myhippoproject-repository-data ---
[INFO] No match to regex '"true"' found in '"false"'. The initial value
'"false"' is left as-is...
[INFO]
[INFO] --- build-helper-maven-plugin:3.0.0:regex-property (property-
commandline-online) # myhippoproject-repository-data ---
[INFO]
[INFO] --- maven-remote-resources-plugin:1.5:process (default) #
myhippoproject-repository-data ---
[INFO]
[INFO] --- maven-source-plugin:3.0.1:jar-no-fork (attach-sources-no-fork) #
myhippoproject-repository-data ---
[INFO]
[INFO] ---------------------------------------------------------------------
---
[INFO] Building My Hippo Project Repository Data For Application 0.1.0-
SNAPSHOT
[INFO] ---------------------------------------------------------------------
---
[INFO]
[INFO] --- maven-clean-plugin:2.5:clean (default-clean) # myhippoproject-
repository-data-application ---
[INFO]
[INFO] --- maven-enforcer-plugin:1.4:enforce (enforce-maven-versions) #
myhippoproject-repository-data-application ---
[INFO]
[INFO] --- build-helper-maven-plugin:3.0.0:regex-property (property-
commandline-offline) # myhippoproject-repository-data-application ---
[INFO] No match to regex '"true"' found in '"false"'. The initial value
'"false"' is left as-is...
[INFO]
[INFO] --- build-helper-maven-plugin:3.0.0:regex-property (property-
commandline-online) # myhippoproject-repository-data-application ---
[INFO]
[INFO] --- buildnumber-maven-plugin:1.4:create (default) # myhippoproject-
repository-data-application ---
[INFO] Executing: cmd.exe /X /C "git rev-parse --verify HEAD"
[INFO] Working directory: C:\Users\Administrator\myhippoproject\repository-
data\application
[INFO] ----------------------------------------------------------------------
--
[INFO] Reactor Summary:
[INFO]
[INFO] My Hippo Project ................................... SUCCESS [ 1.328
s]
[INFO] My Hippo Project Repository Data ................... SUCCESS [ 0.062
s]
[INFO] My Hippo Project Repository Data For Application ... FAILURE [ 0.469
s]
[INFO] My Hippo Project Repository Data For Development ... SKIPPED
[INFO] My Hippo Project Site .............................. SKIPPED
[INFO] My Hippo Project Repository Data Web Files ......... SKIPPED
[INFO] My Hippo Project CMS ............................... SKIPPED
[INFO] My Hippo Project Essentials ........................ SKIPPED
[INFO] ----------------------------------------------------------------------
--
[INFO] BUILD FAILURE
[INFO] ----------------------------------------------------------------------
--
[INFO] Total time: 2.766 s
[INFO] Finished at: 2017-09-19T11:48:05+02:00
[INFO] Final Memory: 21M/316M
[INFO] ----------------------------------------------------------------------
--
[ERROR] Failed to execute goal org.codehaus.mojo:buildnumber-maven-
plugin:1.4:create (default) on project myhippoproject-repository-data-
application: Cannot get the revision information from the scm repository :
[ERROR] Exception while executing SCM command.: Error while executing
command. Error while executing process. Cannot run program "git" (in
directory "C:\Users\Administrator\myhippoproject\repository-
data\application"): CreateProcess error=2, The system cannot find the file
specified
[ERROR] -> [Help 1]
[ERROR]
[ERROR] To see the full stack trace of the errors, re-run Maven with the -e
switch.
[ERROR] Re-run Maven using the -X switch to enable full debug logging.
[ERROR]
[ERROR] For more information about the errors and possible solutions, please
read the following articles:
[ERROR] [Help 1]
http://cwiki.apache.org/confluence/display/MAVEN/MojoExecutionException
[ERROR]
[ERROR] After correcting the problems, you can resume the build with the
command
[ERROR] mvn <goals> -rf :myhippoproject-repository-data-application
[1]: https://i.stack.imgur.com/j7Lm8.png
Your build problem seems to be related to a maven plugin that tries to execute a git command. See this line in your log:
[ERROR] Exception while executing SCM command.: Error while executing
command. Error while executing process. Cannot run program "git" (in
directory "C:\Users\Administrator\myhippoproject\repository-
data\application"): CreateProcess error=2, The system cannot find the file
specified
It seems it requires git to be installed on your system. You probably need to install git first and then try that build command again.
You shouldn't need git to build Hippo, but something seems to be wrong in the 12.0.1 archetype. I will file a bug. Please install git if you can.
I am using eclipse Luna + maven 3.2 . I have developed small application and trying to move to console.developers.google.com using mvn:appengine:devserver .
But i am getting build failure . below is the error .
[INFO] Scanning for projects...
[INFO]
[INFO] ------------------------------------------------------------------------
[INFO] Building helloworld 1.0-SNAPSHOT
[INFO] ------------------------------------------------------------------------
[INFO]
[INFO] >>> appengine-maven-plugin:1.9.32:devserver (default-cli) > package # helloworld >>>
[INFO]
[INFO] --- maven-resources-plugin:2.6:resources (default-resources) # helloworld ---
[INFO] Using 'UTF-8' encoding to copy filtered resources.
[INFO] skip non existing resourceDirectory F:\googleAppEngine\helloworld\src\main\resources
[INFO]
[INFO] --- maven-compiler-plugin:3.1:compile (default-compile) # helloworld ---
[INFO] Nothing to compile - all classes are up to date
[INFO]
[INFO] --- maven-resources-plugin:2.6:testResources (default-testResources) # helloworld ---
[INFO] Using 'UTF-8' encoding to copy filtered resources.
[INFO] skip non existing resourceDirectory F:\googleAppEngine\helloworld\src\test\resources
[INFO]
[INFO] --- maven-compiler-plugin:3.1:testCompile (default-testCompile) # helloworld ---
[INFO] Nothing to compile - all classes are up to date
[INFO]
[INFO] --- maven-surefire-plugin:2.12.4:test (default-test) # helloworld ---
[INFO]
[INFO] --- maven-war-plugin:2.4:war (default-war) # helloworld ---
[INFO] Packaging webapp
[INFO] Assembling webapp [helloworld] in [F:\googleAppEngine\helloworld\target\helloworld-1.0-SNAPSHOT]
[INFO] Processing war project
[INFO] Copying webapp webResources [F:\googleAppEngine\helloworld/src/main/webapp/WEB-INF] to [F:\googleAppEngine\helloworld\target\helloworld-1.0-SNAPSHOT]
[INFO] Copying webapp resources [F:\googleAppEngine\helloworld\src\main\webapp]
[INFO] Webapp assembled in [121 msecs]
[INFO] Building war: F:\googleAppEngine\helloworld\target\helloworld-1.0-SNAPSHOT.war
[INFO]
[INFO] <<< appengine-maven-plugin:1.9.32:devserver (default-cli) < package # helloworld <<<
[INFO]
[INFO] --- appengine-maven-plugin:1.9.32:devserver (default-cli) # helloworld ---
[INFO]
[INFO] Google App Engine Java SDK - Running Development Server
[INFO]
[INFO] Retrieving Google App Engine Java SDK from Maven
[INFO] ------------------------------------------------------------------------
[INFO] BUILD FAILURE
[INFO] ------------------------------------------------------------------------
[INFO] Total time: 6.016 s
[INFO] Finished at: 2016-03-09T08:14:33+05:30
[INFO] Final Memory: 15M/219M
[INFO] ------------------------------------------------------------------------
[ERROR] Failed to execute goal com.google.appengine:appengine-maven-plugin:1.9.32:devserver (default-cli) on project helloworld: Execution default-cli of goal com.google.appengine:appengine-maven-plugin:1.9.32:devserver failed. NoSuchElementException -> [Help 1]
[ERROR]
[ERROR] To see the full stack trace of the errors, re-run Maven with the -e switch.
[ERROR] Re-run Maven using the -X switch to enable full debug logging.
[ERROR]
[ERROR] For more information about the errors and possible solutions, please read the following articles:
[ERROR] [Help 1] http://cwiki.apache.org/confluence/display/MAVEN/PluginExecutionException
I'm getting an error trying to deploy the CLIFF .war to my tomcat7 server.
[ERROR] Failed to execute goal org.apache.tomcat.maven:tomcat7-maven-plugin:2.1:deploy (default-cli) on project cliff: Cannot invoke Tomcat manager: Connection to http://localhost:8080 refused: Connection refused
OS X 10.10.5
Apache Tomcat/8.0.24
JVM 1.8.0_05-b13
David-Laxers-MacBook-Pro:CLIFF davidlaxer$ mvn -version
Apache Maven 3.2.1 (ea8b2b07643dbb1b84b6d16e1f08391b666bc1e9; 2014-02-14T09:37:52-08:00)
Maven home: /Users/davidlaxer/Downloads/apache-maven-3.2.1
Java version: 1.8.0_05, vendor: Oracle Corporation
Java home: /Library/Java/JavaVirtualMachines/jdk1.8.0_05.jdk/Contents/Home/jre
Default locale: en_US, platform encoding: UTF-8
OS name: "mac os x", version: "10.10.5", arch: "x86_64", family: "mac"
David-Laxers-MacBook-Pro:CLIFF davidlaxer$
David-Laxers-MacBook-Pro:CLIFF davidlaxer$ sudo mvn tomcat7:deploy -DskipTests
[INFO] Scanning for projects...
[INFO] ------------------------------------------------------------------------
[INFO] Reactor Build Order:
[INFO]
[INFO] CLIFF
[INFO] common
[INFO] stanford-entity-extractor
[INFO] cliff
[INFO]
[INFO] Using the builder org.apache.maven.lifecycle.internal.builder.singlethreaded.SingleThreadedBuilder with a thread count of 1
[INFO]
[INFO] ------------------------------------------------------------------------
[INFO] Building CLIFF 2.3.0
[INFO] ------------------------------------------------------------------------
[INFO]
[INFO] >>> tomcat7-maven-plugin:2.1:deploy (default-cli) # CLIFF >>>
[INFO]
[INFO] <<< tomcat7-maven-plugin:2.1:deploy (default-cli) # CLIFF <<<
[INFO]
[INFO] --- tomcat7-maven-plugin:2.1:deploy (default-cli) # CLIFF ---
[INFO] Skipping non-war project
[INFO]
[INFO] ------------------------------------------------------------------------
[INFO] Building common 2.3.0
[INFO] ------------------------------------------------------------------------
[INFO]
[INFO] >>> tomcat7-maven-plugin:2.1:deploy (default-cli) # common >>>
[INFO]
[INFO] --- maven-resources-plugin:2.6:resources (default-resources) # common ---
[INFO] Using 'UTF-8' encoding to copy filtered resources.
[INFO] skip non existing resourceDirectory /Users/davidlaxer/CLIFF/common/src/main/resources
[INFO]
[INFO] --- maven-compiler-plugin:3.1:compile (default-compile) # common ---
[INFO] Nothing to compile - all classes are up to date
[INFO]
[INFO] --- maven-resources-plugin:2.6:testResources (default-testResources) # common ---
[INFO] Using 'UTF-8' encoding to copy filtered resources.
[INFO] skip non existing resourceDirectory /Users/davidlaxer/CLIFF/common/src/test/resources
[INFO]
[INFO] --- maven-compiler-plugin:3.1:testCompile (default-testCompile) # common ---
[INFO] No sources to compile
[INFO]
[INFO] --- maven-surefire-plugin:2.16:test (default-test) # common ---
[INFO] Tests are skipped.
[INFO]
[INFO] --- maven-jar-plugin:2.4:jar (default-jar) # common ---
[INFO]
[INFO] <<< tomcat7-maven-plugin:2.1:deploy (default-cli) # common <<<
[INFO]
[INFO] --- tomcat7-maven-plugin:2.1:deploy (default-cli) # common ---
[INFO] Skipping non-war project
[INFO]
[INFO] ------------------------------------------------------------------------
[INFO] Building stanford-entity-extractor 2.3.0
[INFO] ------------------------------------------------------------------------
[INFO]
[INFO] >>> tomcat7-maven-plugin:2.1:deploy (default-cli) # stanford-entity-extractor >>>
[INFO]
[INFO] --- maven-resources-plugin:2.6:resources (default-resources) # stanford-entity-extractor ---
[INFO] Using 'UTF-8' encoding to copy filtered resources.
[INFO] Copying 14 resources
[INFO]
[INFO] --- maven-compiler-plugin:3.1:compile (default-compile) # stanford-entity-extractor ---
[INFO] Nothing to compile - all classes are up to date
[INFO]
[INFO] --- maven-resources-plugin:2.6:testResources (default-testResources) # stanford-entity-extractor ---
[INFO] Using 'UTF-8' encoding to copy filtered resources.
[INFO] Copying 23 resources
[INFO]
[INFO] --- maven-compiler-plugin:3.1:testCompile (default-testCompile) # stanford-entity-extractor ---
[INFO] Nothing to compile - all classes are up to date
[INFO]
[INFO] --- maven-surefire-plugin:2.16:test (default-test) # stanford-entity-extractor ---
[INFO] Tests are skipped.
[INFO]
[INFO] --- maven-jar-plugin:2.4:jar (default-jar) # stanford-entity-extractor ---
[INFO]
[INFO] <<< tomcat7-maven-plugin:2.1:deploy (default-cli) # stanford-entity-extractor <<<
[INFO]
[INFO] --- tomcat7-maven-plugin:2.1:deploy (default-cli) # stanford-entity-extractor ---
[INFO] Skipping non-war project
[INFO]
[INFO] ------------------------------------------------------------------------
[INFO] Building cliff 2.3.0
[INFO] ------------------------------------------------------------------------
[INFO]
[INFO] >>> tomcat7-maven-plugin:2.1:deploy (default-cli) # cliff >>>
[INFO]
[INFO] --- maven-resources-plugin:2.6:resources (default-resources) # cliff ---
[INFO] Using 'UTF-8' encoding to copy filtered resources.
[INFO] Copying 12 resources
[INFO]
[INFO] --- maven-compiler-plugin:3.1:compile (default-compile) # cliff ---
[INFO] Nothing to compile - all classes are up to date
[INFO]
[INFO] --- maven-resources-plugin:2.6:testResources (default-testResources) # cliff ---
[INFO] Using 'UTF-8' encoding to copy filtered resources.
[INFO] skip non existing resourceDirectory /Users/davidlaxer/CLIFF/webapp/src/test/resources
[INFO]
[INFO] --- maven-compiler-plugin:3.1:testCompile (default-testCompile) # cliff ---
[INFO] No sources to compile
[INFO]
[INFO] --- maven-surefire-plugin:2.16:test (default-test) # cliff ---
[INFO] Tests are skipped.
[INFO]
[INFO] --- maven-war-plugin:2.2:war (default-war) # cliff ---
[INFO] Packaging webapp
[INFO] Assembling webapp [cliff] in [/Users/davidlaxer/CLIFF/webapp/target/cliff-2.3.0]
[INFO] Processing war project
[INFO] Copying webapp resources [/Users/davidlaxer/CLIFF/webapp/src/main/webapp]
[INFO] Webapp assembled in [1345 msecs]
[INFO] Building war: /Users/davidlaxer/CLIFF/webapp/target/cliff-2.3.0.war
[INFO] WEB-INF/web.xml already added, skipping
[INFO]
[INFO] <<< tomcat7-maven-plugin:2.1:deploy (default-cli) # cliff <<<
[INFO]
[INFO] --- tomcat7-maven-plugin:2.1:deploy (default-cli) # cliff ---
[INFO] Deploying war to http://localhost:8080/cliff-2.3.0
[INFO] ------------------------------------------------------------------------
[INFO] Reactor Summary:
[INFO]
[INFO] CLIFF ............................................. SUCCESS [ 1.728 s]
[INFO] common ............................................ SUCCESS [ 1.883 s]
[INFO] stanford-entity-extractor ......................... SUCCESS [ 0.265 s]
[INFO] cliff ............................................. FAILURE [ 11.384 s]
[INFO] ------------------------------------------------------------------------
[INFO] BUILD FAILURE
[INFO] ------------------------------------------------------------------------
[INFO] Total time: 15.717 s
[INFO] Finished at: 2015-08-26T08:07:32-08:00
[INFO] Final Memory: 12M/81M
[INFO] ------------------------------------------------------------------------
[ERROR] Failed to execute goal org.apache.tomcat.maven:tomcat7-maven-plugin:2.1:deploy (default-cli) on project cliff: Cannot invoke Tomcat manager: Connection to http://localhost:8080 refused: Connection refused -> [Help 1]
[ERROR]
[ERROR] To see the full stack trace of the errors, re-run Maven with the -e switch.
[ERROR] Re-run Maven using the -X switch to enable full debug logging.
[ERROR]
[ERROR] For more information about the errors and possible solutions, please read the following articles:
[ERROR] [Help 1] http://cwiki.apache.org/confluence/display/MAVEN/ConnectException
[ERROR]
[ERROR] After correcting the problems, you can resume the build with the command
[ERROR] mvn <goals> -rf :cliff
pom.xml:
<plugin>
<groupId>org.apache.tomcat.maven</groupId>
<artifactId>tomcat7-maven-plugin</artifactId>
<version>2.1</version>
<configuration>
<server>CliffTomcatServer</server>
<path>/${project.build.finalName}</path>
</configuration>
</plugin>
~/.m2/settings.xml:
<server>
<id>CliffTomcatServer</id>
<username>cliff</username>
<password>beer</password>
</server>
/usr/local/apache-tomcat-8.0.24/conftomcat_users.xml:
<tomcat-users>
<role rolename="manager"/>
<role rolename="manager-gui"/>
<role rolename="manager-script"/>
<user username="cliff" password="beer" roles="manager,manager-gui,manager-script"/>
Added to pom.xlm: http://localhost:8080/manager/text
[INFO] Deploying war to http://localhost:8080/cliff-2.3.0
Uploading: http://localhost:8080/manager/text/deploy?path=%2Fcliff-2.3.0
2052/127150 KB
[INFO] I/O exception (java.net.SocketException) caught when processing request: Broken pipe
[INFO] Retrying request
Uploading: http://localhost:8080/manager/text/deploy?path=%2Fcliff-2.3.0
2356/127150 KB
[INFO] I/O exception (java.net.SocketException) caught when processing request: Broken pipe
[INFO] Retrying request
Uploading: http://localhost:8080/manager/text/deploy?path=%2Fcliff-2.3.0
2052/127150 KB
[INFO] I/O exception (java.net.SocketException) caught when processing request: Broken pipe
[INFO] Retrying request
Uploading: http://localhost:8080/manager/text/deploy?path=%2Fcliff-2.3.0
2156/127150 KB
[INFO] ------------------------------------------------------------------------
[INFO] Reactor Summary:
[INFO]
[INFO] CLIFF ............................................. SUCCESS [ 1.523 s]
[INFO] common ............................................ SUCCESS [ 1.718 s]
[INFO] stanford-entity-extractor ......................... SUCCESS [ 0.359 s]
[INFO] cliff ............................................. FAILURE [ 12.664 s]
[INFO] ------------------------------------------------------------------------
[INFO] BUILD FAILURE
[INFO] ------------------------------------------------------------------------
[INFO] Total time: 16.735 s
[INFO] Finished at: 2015-08-26T11:04:23-08:00
[INFO] Final Memory: 12M/81M
[INFO] ------------------------------------------------------------------------
[ERROR] Failed to execute goal org.apache.tomcat.maven:tomcat7-maven-plugin:2.1:deploy (default-cli) on project cliff: Cannot invoke Tomcat manager: Broken pipe -> [Help 1]
[ERROR]
[ERROR] To see the full stack trace of the errors, re-run Maven with the -e switch.
[ERROR] Re-run Maven using the -X switch to enable full debug logging.
[ERROR]
[ERROR] For more information about the errors and possible solutions, please read the following articles:
[ERROR] [Help 1] http://cwiki.apache.org/confluence/display/MAVEN/MojoExecutionException
[ERROR]
[ERROR] After correcting the problems, you can resume the build with the command
[ERROR] mvn <goals> -rf :cliff
David-Laxers-MacBook-Pro:CLIFF davidlaxer$
When I set in the ~/.m2/settings.xml,it does not work. So I set in the pom.xml,like this:
<plugin>
<groupId>org.apache.tomcat.maven</groupId>
<artifactId>tomcat7-maven-plugin</artifactId>
<version>${tomcat7-maven-plugin.version}</version>
<configuration>
<url>http://localhost:8080/manager/text</url>
<server>tomcat</server>
<username>admin1</username>
<password>admin1</password>
<path>/${project.artifactId}</path>
<update>true</update>
</configuration>
</plugin>
And in $CATALINA_HOME/conf/tomcat-users.xml file, in <tomcat-users> element, add as follows:
<role rolename="manager-script"/>
<role rolename="manager-gui"/>
<user username="admin" password="admin" roles="manager-gui"/>
<user username="admin1" password="admin1" roles="manager-script"/>
Then it works for me. :)
The role for deploying on /manager/text is "manager-script" and the Apache Tomcat Manager How-To indicates it shouldn't be applied to a user with the manager-gui role. I use a deployment user with only the manager-script role and no others, and that uploads the WAR file fine without the broken pipe message. If I add the manager-gui role to my deployment user, I get the broken pipe message you encounter. Try changing your tomcat-users.xml to limit Cliff's role to the single manager-script role. Hope it helps.
http://tomcat.apache.org/tomcat-7.0-doc/manager-howto.html
You may need to add this
<configuration>
..
<update>true</update>
..
</configuration>
to your pom.xml file to run
mvn tomcat7:deploy
I got this error when running mvn tomcat7:deploy instead of mvn tomcat7:redeploy.
If you're running CentOS, you may need to install additional management libraries:
yum install tomcat-webapps tomcat-admin-webapps
On other platforms solution may be similar.
I haven't been able to use the mvn redeploy shortcut since I merged in the code that split it into a few mvn modules. I recommend copying the .war file from webapp/target to the tomcat webapps dir on your computer/server.
May be you should check the webapps/manager/WEB-INF/web.xml file to ensure your .war file is smaller than the configured value.
<max-file-size>152428800</max-file-size>
<max-request-size>152428800</max-request-size>
See this question: IBM MobileFirst Platform 6.3 Operational Analytics Failed installation for Tomcat
if you already have the same application deploy on the tomcat server you need to undeploy it first. If you deploy it again it can give your the connection error.